{"text_format":"1","workbook":"xlsx","n_sheets":5,"sheets":["対戦表","大会名","名簿","小学生","その他"],"not_rendered":{"charts":0,"images":0,"macros":1,"external_links":2,"defined_names":3,"comments":0,"pivot_tables":0},"unopened":[],"bounds":{"document_bytes":16777216,"sheet_cells":100000,"rows_first":2000,"rows_last":500,"rows_between":2000,"halvings":0,"cell_chars":16384,"cell_head_chars":4096},"cells_cut":0,"cells_raw":0,"read":"whole","date_system":"1900"}

{"sheet":"対戦表","index":0,"n_rows":20,"n_cols":37,"rows_kept":20,"cut":false,"hidden":false,"merged":[[19,20,21,22],[19,23,21,27],[19,28,21,36],[18,21,18,23],[18,33,18,35],[0,27,0,29],[0,3,0,7],[0,22,0,26],[0,19,1,20],[1,24,1,26],[0,8,0,10],[0,0,1,1],[1,5,1,7],[1,11,1,17],[5,1,5,17],[11,15,11,16],[7,8,8,11],[19,1,21,3],[19,4,21,8],[19,9,21,17],[7,13,9,15],[7,16,9,16],[7,1,8,2],[18,2,18,4],[18,14,18,16],[7,3,8,5],[11,2,11,3],[15,1,15,4],[15,14,15,17],[1,30,1,36],[17,2,17,3],[17,15,17,16],[11,21,11,22],[5,20,5,36],[7,20,8,21],[7,22,8,24],[7,32,9,34],[7,35,9,35],[15,33,15,36],[7,27,8,30],[11,34,11,35],[17,21,17,22],[17,34,17,35],[15,20,15,23]]}
["男子",null,null,"対戦番号",null,null,null,null,"回戦",null,null,null,null,null,null,null,null,null,null,"女子",null,null,"対戦番号",null,null,null,null,"回戦"]
[null,null,null,1,"vs",221,null,null,null,9,"・・・","準決勝は ８ \n決勝　は ９ 　　　　\n決定戦は ０",null,null,null,null,null,null,null,null,null,null,1,"vs",2,null,null,null,2,"・・・","準決勝は ８ \n決勝　は ９ 　　　　\n決定戦は ０"]
[null,null,null,"黄色の部分に入力し，下のボタンを押してください。",null,null,null,null,null,null,null,null,null,null,null,null,null,null,null,null,null,null,"黄色の部分に入力し，下のボタンを押してください。"]
[null,null,null,"Ctrl＋Dを押す。",null,null,null,null,null,null,null,null,null,null,null,null,null,null,null,null,null,null,"Ctrl＋Jを押す。"]
[]
[null,{"$f":"大会名!B4","v":"2011　国体（県大会）"},null,null,null,null,null,null,null,null,null,null,null,null,null,null,null,null,null,null,{"$f":"大会名!B4","v":"2011　国体（県大会）"}]
[]
[null,"男子",null,{"$f":"VLOOKUP(J2,その他!A1:B10,2)","v":"決勝"},null,null,null,null,"シングルス",null,null,null,null,null,null,null,"コート",null,null,null,"女子",null,{"$f":"VLOOKUP(AC2,その他!A1:B10,2)","v":"２回戦"},null,null,null,null,"シングルス",null,null,null,null,null,null,null,"コート"]
[]
[]
[]
[null,null,{"$f":"D2","v":1},null,null,null,null,null,null,null,null,null,null,null,null,{"$f":"F2","v":221},null,null,null,null,null,{"$f":"W2","v":1},null,null,null,null,null,null,null,null,null,null,null,null,{"$f":"Y2","v":2}]
[]
[null,null,null,null,null,null,null,null,null,"－",null,null,null,null,null,null,null,null,null,null,null,null,null,null,null,null,null,null,"－"]
[null,null,null,null,null,null,null,null,null,"－",null,null,null,null,null,null,null,null,null,null,null,null,null,null,null,null,null,null,"－"]
[null,{"$f":"VLOOKUP(C12,名簿!$A$3:$C$500,2)","v":0},null,null,null,null,null,null,null,"－",null,null,null,null,{"$f":"VLOOKUP(P12,名簿!$A$3:$C$500,2)","v":0},null,null,null,null,null,{"$f":"VLOOKUP(V12,名簿!$E$3:$G$500,2)","v":0},null,null,null,null,null,null,null,"－",null,null,null,null,{"$f":"VLOOKUP(AI12,名簿!$E$3:$G$500,2)","v":0}]
[null,null,null,null,null,null,null,null,null,"－",null,null,null,null,null,null,null,null,null,null,null,null,null,null,null,null,null,null,"－"]
[null,null,"ｻｰﾋﾞｽ　 ﾚｼｰﾌﾞ",null,null,null,null,null,null,"－",null,null,null,null,null,"ｻｰﾋﾞｽ　 ﾚｼｰﾌﾞ",null,null,null,null,null,"ｻｰﾋﾞｽ　 ﾚｼｰﾌﾞ",null,null,null,null,null,null,"－",null,null,null,null,null,"ｻｰﾋﾞｽ　 ﾚｼｰﾌﾞ"]
[null,"（",{"$f":"VLOOKUP(C12,名簿!$A$3:$C$500,3)","v":0},null,null,"）",null,null,null,null,null,null,null,"（",{"$f":"VLOOKUP(P12,名簿!$A$3:$C$500,3)","v":0},null,null,"）",null,null,"（",{"$f":"VLOOKUP(V12,名簿!$E$3:$G$500,3)","v":0},null,null,"）",null,null,null,null,null,null,null,"（",{"$f":"VLOOKUP(AI12,名簿!$E$3:$G$500,3)","v":0},null,null,"）"]
[null,"試合開始時刻",null,null,"試合終了時刻",null,null,null,null,"審判",null,null,null,null,null,null,null,null,null,null,"試合開始時刻",null,null,"試合終了時刻",null,null,null,null,"審判"]

{"sheet":"大会名","index":1,"n_rows":4,"n_cols":2,"rows_kept":4,"cut":false,"hidden":false,"merged":[]}
[]
[]
[null,"大会名"]
[null,"2011　国体（県大会）"]

{"sheet":"名簿","index":2,"n_rows":500,"n_cols":7,"rows_kept":500,"cut":false,"hidden":false,"merged":[]}
[null,"男子",null,null,null,"女子"]
[null,"名前","学校",null,null,"名前","学校"]
[1,null,null,null,1]
[2,null,null,null,2]
[3,null,null,null,3]
[4,null,null,null,4]
[5,null,null,null,5]
[6,null,null,null,6]
[7,null,null,null,7]
[8,null,null,null,8]
[9,null,null,null,9]
[10,null,null,null,10]
[11,null,null,null,11]
[12,null,null,null,12]
[13,null,null,null,13]
[14,null,null,null,14]
[15,null,null,null,15]
[16,null,null,null,16]
[17,null,null,null,17]
[18,null,null,null,18]
[19,null,null,null,19]
[20,null,null,null,20]
[21,null,null,null,21]
[22,null,null,null,22]
[23,null,null,null,23]
[24,null,null,null,24]
[25,null,null,null,25]
[26,null,null,null,26]
[27,null,null,null,27]
[28,null,null,null,28]
[29,null,null,null,29]
[30,null,null,null,30]
[31,null,null,null,31]
[32,null,null,null,32]
[33,null,null,null,33]
[34,null,null,null,34]
[35,null,null,null,35]
[36,null,null,null,36]
[37,null,null,null,37]
[38,null,null,null,38]
[39,null,null,null,39]
[40,null,null,null,40]
[41,null,null,null,41]
[42,null,null,null,42]
[43,null,null,null,43]
[44,null,null,null,44]
[45,null,null,null,45]
[46,null,null,null,46]
[47,null,null,null,47]
[48,null,null,null,48]
[49,null,null,null,49]
[50,null,null,null,50]
[51,null,null,null,51]
[52,null,null,null,52]
[53,null,null,null,53]
[54,null,null,null,54]
[55,null,null,null,55]
[56,null,null,null,56]
[57,null,null,null,57]
[58,null,null,null,58]
[59,null,null,null,59]
[60,null,null,null,60]
[61,null,null,null,61]
[62,null,null,null,62]
[63,null,null,null,63]
[64,null,null,null,64]
[65,null,null,null,65]
[66,null,null,null,66]
[67,null,null,null,67]
[68,null,null,null,68]
[69,null,null,null,69]
[70,null,null,null,70]
[71,null,null,null,71]
[72,null,null,null,72]
[73,null,null,null,73]
[74,null,null,null,74]
[75,null,null,null,75]
[76,null,null,null,76]
[77,null,null,null,77]
[78,null,null,null,78]
[79,null,null,null,79]
[80,null,null,null,80]
[81,null,null,null,81]
[82,null,null,null,82]
[83,null,null,null,83]
[84,null,null,null,84]
[85,null,null,null,85]
[86,null,null,null,86]
[87,null,null,null,87]
[88,null,null,null,88]
[89,null,null,null,89]
[90,null,null,null,90]
[91,null,null,null,91]
[92,null,null,null,92]
[93,null,null,null,93]
[94,null,null,null,94]
[95,null,null,null,95]
[96,null,null,null,96]
[97,null,null,null,97]
[98,null,null,null,98]
[99,null,null,null,99]
[100,null,null,null,100]
[101,null,null,null,101]
[102,null,null,null,102]
[103,null,null,null,103]
[104,null,null,null,104]
[105,null,null,null,105]
[106,null,null,null,106]
[107,null,null,null,107]
[108,null,null,null,108]
[109,null,null,null,109]
[110,null,null,null,110]
[111,null,null,null,111]
[112,null,null,null,112]
[113,null,null,null,113]
[114,null,null,null,114]
[115,null,null,null,115]
[116,null,null,null,116]
[117,null,null,null,117]
[118,null,null,null,118]
[119,null,null,null,119]
[120,null,null,null,120]
[121,null,null,null,121]
[122,null,null,null,122]
[123,null,null,null,123]
[124,null,null,null,124]
[125,null,null,null,125]
[126,null,null,null,126]
[127,null,null,null,127]
[128,null,null,null,128]
[129,null,null,null,129]
[130,null,null,null,130]
[131,null,null,null,131]
[132,null,null,null,132]
[133,null,null,null,133]
[134,null,null,null,134]
[135,null,null,null,135]
[136,null,null,null,136]
[137,null,null,null,137]
[138,null,null,null,138]
[139,null,null,null,139]
[140,null,null,null,140]
[141,null,null,null,141]
[142,null,null,null,142]
[143,null,null,null,143]
[144,null,null,null,144]
[145,null,null,null,145]
[146,null,null,null,146]
[147,null,null,null,147]
[148,null,null,null,148]
[149,null,null,null,149]
[150,null,null,null,150]
[151,null,null,null,151]
[152,null,null,null,152]
[153,null,null,null,153]
[154,null,null,null,154]
[155,null,null,null,155]
[156,null,null,null,156]
[157,null,null,null,157]
[158,null,null,null,158]
[159,null,null,null,159]
[160,null,null,null,160]
[161,null,null,null,161]
[162,null,null,null,162]
[163,null,null,null,163]
[164,null,null,null,164]
[165,null,null,null,165]
[166,null,null,null,166]
[167,null,null,null,167]
[168,null,null,null,168]
[169,null,null,null,169]
[170,null,null,null,170]
[171,null,null,null,171]
[172,null,null,null,172]
[173,null,null,null,173]
[174,null,null,null,174]
[175,null,null,null,175]
[176,null,null,null,176]
[177,null,null,null,177]
[178,null,null,null,178]
[179,null,null,null,179]
[180,null,null,null,180]
[181,null,null,null,181]
[182,null,null,null,182]
[183,null,null,null,183]
[184,null,null,null,184]
[185,null,null,null,185]
[186,null,null,null,186]
[187,null,null,null,187]
[188,null,null,null,188]
[189,null,null,null,189]
[190,null,null,null,190]
[191,null,null,null,191]
[192,null,null,null,192]
[193,null,null,null,193]
[194,null,null,null,194]
[195,null,null,null,195]
[196,null,null,null,196]
[197,null,null,null,197]
[198,null,null,null,198]
[199,null,null,null,199]
[200,null,null,null,200]
[201,null,null,null,201]
[202,null,null,null,202]
[203,null,null,null,203]
[204,null,null,null,204]
[205,null,null,null,205]
[206,null,null,null,206]
[207,null,null,null,207]
[208,null,null,null,208]
[209,null,null,null,209]
[210,null,null,null,210]
[211,null,null,null,211]
[212,null,null,null,212]
[213,null,null,null,213]
[214,null,null,null,214]
[215,null,null,null,215]
[216,null,null,null,216]
[217,null,null,null,217]
[218,null,null,null,218]
[219,null,null,null,219]
[220,null,null,null,220]
[221,null,null,null,221]
[222,null,null,null,222]
[223,null,null,null,223]
[224,null,null,null,224]
[225,null,null,null,225]
[226,null,null,null,226]
[227,null,null,null,227]
[228,null,null,null,228]
[229,null,null,null,229]
[230,null,null,null,230]
[231,null,null,null,231]
[232,null,null,null,232]
[233,null,null,null,233]
[234,null,null,null,234]
[235,null,null,null,235]
[236,null,null,null,236]
[237,null,null,null,237]
[238,null,null,null,238]
[239,null,null,null,239]
[240,null,null,null,240]
[241,null,null,null,241]
[242,null,null,null,242]
[243,null,null,null,243]
[244,null,null,null,244]
[245,null,null,null,245]
[246,null,null,null,246]
[247,null,null,null,247]
[248,null,null,null,248]
[249,null,null,null,249]
[250,null,null,null,250]
[251,null,null,null,251]
[252,null,null,null,252]
[253,null,null,null,253]
[254,null,null,null,254]
[255,null,null,null,255]
[256,null,null,null,256]
[257,null,null,null,257]
[258,null,null,null,258]
[259,null,null,null,259]
[260,null,null,null,260]
[261,null,null,null,261]
[262,null,null,null,262]
[263,null,null,null,263]
[264,null,null,null,264]
[265,null,null,null,265]
[266,null,null,null,266]
[267,null,null,null,267]
[268,null,null,null,268]
[269,null,null,null,269]
[270,null,null,null,270]
[271,null,null,null,271]
[272,null,null,null,272]
[273,null,null,null,273]
[274,null,null,null,274]
[275,null,null,null,275]
[276,null,null,null,276]
[277,null,null,null,277]
[278,null,null,null,278]
[279,null,null,null,279]
[280,null,null,null,280]
[281,null,null,null,281]
[282,null,null,null,282]
[283,null,null,null,283]
[284,null,null,null,284]
[285,null,null,null,285]
[286,null,null,null,286]
[287,null,null,null,287]
[288,null,null,null,288]
[289,null,null,null,289]
[290,null,null,null,290]
[291,null,null,null,291]
[292,null,null,null,292]
[293,null,null,null,293]
[294,null,null,null,294]
[295,null,null,null,295]
[296,null,null,null,296]
[297,null,null,null,297]
[298,null,null,null,298]
[299,null,null,null,299]
[300,null,null,null,300]
[301,null,null,null,301]
[302,null,null,null,302]
[303,null,null,null,303]
[304,null,null,null,304]
[305,null,null,null,305]
[306,null,null,null,306]
[307,null,null,null,307]
[308,null,null,null,308]
[309,null,null,null,309]
[310,null,null,null,310]
[311,null,null,null,311]
[312,null,null,null,312]
[313,null,null,null,313]
[314,null,null,null,314]
[315,null,null,null,315]
[316,null,null,null,316]
[317,null,null,null,317]
[318,null,null,null,318]
[319,null,null,null,319]
[320,null,null,null,320]
[321,null,null,null,321]
[322,null,null,null,322]
[323,null,null,null,323]
[324,null,null,null,324]
[325,null,null,null,325]
[326,null,null,null,326]
[327,null,null,null,327]
[328,null,null,null,328]
[329,null,null,null,329]
[330,null,null,null,330]
[331,null,null,null,331]
[332,null,null,null,332]
[333,null,null,null,333]
[334,null,null,null,334]
[335,null,null,null,335]
[336,null,null,null,336]
[337,null,null,null,337]
[338,null,null,null,338]
[339,null,null,null,339]
[340,null,null,null,340]
[341,null,null,null,341]
[342,null,null,null,342]
[343,null,null,null,343]
[344,null,null,null,344]
[345,null,null,null,345]
[346,null,null,null,346]
[347,null,null,null,347]
[348,null,null,null,348]
[349,null,null,null,349]
[350,null,null,null,350]
[351,null,null,null,351]
[352,null,null,null,352]
[353,null,null,null,353]
[354,null,null,null,354]
[355,null,null,null,355]
[356,null,null,null,356]
[357,null,null,null,357]
[358,null,null,null,358]
[359,null,null,null,359]
[360,null,null,null,360]
[361,null,null,null,361]
[362,null,null,null,362]
[363,null,null,null,363]
[364,null,null,null,364]
[365,null,null,null,365]
[366,null,null,null,366]
[367,null,null,null,367]
[368,null,null,null,368]
[369,null,null,null,369]
[370,null,null,null,370]
[371,null,null,null,371]
[372,null,null,null,372]
[373,null,null,null,373]
[374,null,null,null,374]
[375,null,null,null,375]
[376,null,null,null,376]
[377,null,null,null,377]
[378,null,null,null,378]
[379,null,null,null,379]
[380,null,null,null,380]
[381,null,null,null,381]
[382,null,null,null,382]
[383,null,null,null,383]
[384,null,null,null,384]
[385,null,null,null,385]
[386,null,null,null,386]
[387,null,null,null,387]
[388,null,null,null,388]
[389,null,null,null,389]
[390,null,null,null,390]
[391,null,null,null,391]
[392,null,null,null,392]
[393,null,null,null,393]
[394,null,null,null,394]
[395,null,null,null,395]
[396,null,null,null,396]
[397,null,null,null,397]
[398,null,null,null,398]
{"$rows_left_out":101}
{"sheet":"小学生","index":3,"n_rows":21,"n_cols":13,"rows_kept":21,"cut":false,"hidden":true,"merged":[[15,1,16,1],[19,1,20,1],[15,11,16,11],[19,11,20,11],[2,1,3,1],[5,1,6,1],[8,1,9,1],[2,11,3,11],[5,11,6,11],[8,11,9,11]]}
["【小学生男子】"]
[null,"●　決勝トーナメント"]
[null,101,{"$f":"VLOOKUP(B3,名簿!$A$3:$C$154,2)","v":0},"A",null,null,null,null,null,null,"B",105,{"$f":"VLOOKUP(L3,名簿!$A$3:$C$154,2)","v":0}]
[null,null,{"$f":"VLOOKUP(B3,名簿!$A$3:$C$154,3)","v":0},"1位",null,null,null,null,null,null,"1位",null,{"$f":"VLOOKUP(L3,名簿!$A$3:$C$154,3)","v":0}]
[]
[null,108,{"$f":"VLOOKUP(B6,名簿!$A$3:$C$154,2)","v":0},"C",null,null,null,null,null,null,"A",103,{"$f":"VLOOKUP(L6,名簿!$A$3:$C$154,2)","v":0}]
[null,null,{"$f":"VLOOKUP(B6,名簿!$A$3:$C$154,3)","v":0},"2位",null,null,null,null,null,null,"2位",null,{"$f":"VLOOKUP(L6,名簿!$A$3:$C$154,3)","v":0}]
[]
[null,104,{"$f":"VLOOKUP(B9,名簿!$A$3:$C$154,2)","v":0},"B",null,null,null,null,null,null,"C",107,{"$f":"VLOOKUP(L9,名簿!$A$3:$C$154,2)","v":0}]
[null,null,{"$f":"VLOOKUP(B9,名簿!$A$3:$C$154,3)","v":0},"2位",null,null,null,null,null,null,"1位",null,{"$f":"VLOOKUP(L9,名簿!$A$3:$C$154,3)","v":0}]
[]
[]
[]
["【小学生女子】"]
[null,"●　決勝トーナメント"]
[null,null,{"$f":"VLOOKUP(B16,名簿!$E$3:$G$64,2)","v":{"$error":"#N/A"}},"A",null,null,null,null,null,null,"A",null,{"$f":"VLOOKUP(L16,名簿!$E$3:$G$64,2)","v":{"$error":"#N/A"}}]
[null,null,{"$f":"VLOOKUP(B16,名簿!$E$3:$G$64,3)","v":{"$error":"#N/A"}},"1位",null,null,null,null,null,null,"2位",null,{"$f":"VLOOKUP(L16,名簿!$E$3:$G$64,3)","v":{"$error":"#N/A"}}]
[]
[]
[null,null,{"$f":"VLOOKUP(B20,名簿!$E$3:$G$64,2)","v":{"$error":"#N/A"}},"B",null,null,null,null,null,null,"B",null,{"$f":"VLOOKUP(L20,名簿!$E$3:$G$64,2)","v":{"$error":"#N/A"}}]
[null,null,{"$f":"VLOOKUP(B20,名簿!$E$3:$G$64,3)","v":{"$error":"#N/A"}},"2位",null,null,null,null,null,null,"1位",null,{"$f":"VLOOKUP(L20,名簿!$E$3:$G$64,3)","v":{"$error":"#N/A"}}]

{"sheet":"その他","index":4,"n_rows":10,"n_cols":2,"rows_kept":10,"cut":false,"hidden":true,"merged":[]}
[0,"決定戦"]
[1,"１回戦"]
[2,"２回戦"]
[3,"３回戦"]
[4,"４回戦"]
[5,"５回戦"]
[6,"６回戦"]
[7,"７回戦"]
[8,"準決勝"]
[9,"決勝"]