{"text_format":"1","workbook":"xlsx","n_sheets":5,"sheets":["個人戦","シングルス　選手名簿","ダブルス　選手名簿","選手参照","参照"],"not_rendered":{"charts":0,"images":0,"macros":1,"external_links":0,"defined_names":1,"comments":0,"pivot_tables":0},"unopened":[],"bounds":{"document_bytes":16777216,"sheet_cells":100000,"rows_first":2000,"rows_last":500,"rows_between":2000,"halvings":0,"cell_chars":16384,"cell_head_chars":4096},"cells_cut":0,"cells_raw":0,"read":"whole","date_system":"1900"}

{"sheet":"個人戦","index":0,"n_rows":18,"n_cols":28,"rows_kept":18,"cut":false,"hidden":false,"merged":[[4,4,4,14],[4,15,4,17],[4,1,4,3],[7,7,11,7],[13,1,14,3],[7,8,11,8],[13,4,14,7],[10,1,11,2],[10,4,11,6],[4,18,4,21],[3,1,3,3],[10,3,11,3],[3,26,4,26],[5,23,6,23],[5,24,6,24],[6,26,7,26],[6,1,6,6],[6,8,6,14],[6,16,6,21],[7,9,11,9],[7,15,11,15],[7,23,8,23],[8,1,9,6],[7,1,7,3],[10,23,10,26],[1,1,1,21],[2,20,2,21],[3,7,3,9],[3,11,3,14],[3,15,3,17],[3,18,3,21],[2,6,2,7],[2,16,2,18],[2,9,2,14],[12,23,13,27],[14,23,17,27],[17,1,18,4],[17,5,18,6],[16,1,16,4],[17,17,18,21],[17,9,18,15],[16,5,16,6],[13,15,14,16],[13,17,14,21],[16,9,16,15],[16,17,16,21],[7,13,11,13],[10,18,11,21],[7,14,11,14],[7,16,7,17],[8,16,9,21],[10,16,11,16],[10,17,11,17]]}
[]
[null,{"$f":"X15","v":"平成２３年度　長野県高等学校総合体育大会\n【卓球競技会】"},null,null,null,null,null,null,null,null,null,null,null,null,null,null,null,null,null,null,null,null,null,"　シングルス・・・１\n　ダブルス　・・・２",1]
[null,null,null,null,null,null,"個人戦",null,"（",{"$f":"VLOOKUP($Y$2,参照!$A$3:$B$4,2)","v":"シングルス"},null,null,null,null,null,"）","記録用紙",null,null,null,null,null,null,"　男子・・・１\n　女子・・・２",2]
[null,"性別",null,null,null,null,"（",{"$f":"IF(Y4<=6,VLOOKUP($Y$4,参照!$A$11:$B$19,2),\"\")","v":"１"},null,null,"）","回戦",null,null,null,"試合番号",null,null,"コート番号",null,null,null,null,"　○回戦",1,null,"準決勝：7\n決　勝：8\n決定戦：9"]
[null,{"$f":"VLOOKUP($Y$3,参照!$A$7:$B$8,2)","v":"女子"},null,null,{"$f":"IF($Y$4>=7,VLOOKUP(個人戦!$Y$4,参照!$A$11:$B$19,2),\"\")","v":""},null,null,null,null,null,null,null,null,null,null,{"$f":"Y6","v":"1-32"},null,null,{"$f":"AA7","v":0}]
[null,null,null,null,null,null,null,null,null,null,null,null,null,null,null,null,null,null,null,null,null,null,null,"試合番号","1-32",null,"コート番号"]
[null,"選手名",null,null,null,null,null,"ＳＲ","対戦記録",null,null,null,null,null,null,"ＳＲ","選手名"]
[null,{"$f":"Y8","v":1},null,null,null,null,null,null,null,null,null,"―",null,null,null,null,{"$f":"Y9","v":2},null,null,null,null,null,null,"選手番号",1]
[null,{"$f":"VLOOKUP($Y$2*10000+$Y$3*1000+$Y$8,選手参照!$A$3:$D$1952,2)","v":0},null,null,null,null,null,null,null,null,null,"―",null,null,null,null,{"$f":"VLOOKUP($Y$2*10000+$Y$3*1000+$Y$9,選手参照!$A$3:$D$1952,2)","v":0},null,null,null,null,null,null,null,2]
[null,null,null,null,null,null,null,null,null,null,null,"―"]
[null,{"$f":"VLOOKUP($Y$2*10000+$Y$3*1000+$Y$8,選手参照!$A$3:$D$1952,4)","v":0},null,"県",{"$f":"VLOOKUP($Y$2*10000+$Y$3*1000+$Y$8,選手参照!$A$3:$D$1952,3)","v":0},null,null,null,null,null,null,"―",null,null,null,null,{"$f":"VLOOKUP($Y$2*10000+$Y$3*1000+$Y$9,選手参照!$A$3:$D$1952,4)","v":0},"県",{"$f":"VLOOKUP($Y$2*10000+$Y$3*1000+$Y$9,選手参照!$A$3:$D$1952,3)","v":0},null,null,null,null,"印刷は，『Cｔｒｌ＋P』　を押して下さい。",null,null,null,"※　マクロは有効にしてください。"]
[null,null,null,null,null,null,null,null,null,null,null,"―"]
[null,null,null,null,null,null,null,null,null,null,null,null,null,null,null,null,null,null,null,null,null,null,null,"大会名称"]
[null,"選手サイン",null,null,null,null,null,null,null,null,null,null,null,null,null,"選手サイン"]
[null,null,null,null,null,null,null,null,null,null,null,null,null,null,null,null,null,null,null,null,null,null,null,"平成２３年度　長野県高等学校総合体育大会\n【卓球競技会】"]
[]
[null,"開　始　時　刻",null,null,null,"　終　了　時　刻　",null,null,null,"主審サイン",null,null,null,null,null,null,null,"審判長サイン"]
[null,"　　　　時　　　　分",null,null,null,"　　　　時　　　　分"]

{"sheet":"シングルス　選手名簿","index":1,"n_rows":502,"n_cols":9,"rows_kept":502,"cut":false,"hidden":false,"merged":[[0,0,0,1],[0,5,0,6]]}
["男子シングルス",null,null,null,null,"女子シングルス"]
[null,"氏名","チーム名","県名",null,null,"氏名","チーム名","県名"]
[1,null,null,null,null,1]
[2,null,null,null,null,2]
[3,null,null,null,null,3]
[4,null,null,null,null,4]
[5,null,null,null,null,5]
[6,null,null,null,null,6]
[7,null,null,null,null,7]
[8,null,null,null,null,8]
[9,null,null,null,null,9]
[10,null,null,null,null,10]
[11,null,null,null,null,11]
[12,null,null,null,null,12]
[13,null,null,null,null,13]
[14,null,null,null,null,14]
[15,null,null,null,null,15]
[16,null,null,null,null,16]
[17,null,null,null,null,17]
[18,null,null,null,null,18]
[19,null,null,null,null,19]
[20,null,null,null,null,20]
[21,null,null,null,null,21]
[22,null,null,null,null,22]
[23,null,null,null,null,23]
[24,null,null,null,null,24]
[25,null,null,null,null,25]
[26,null,null,null,null,26]
[27,null,null,null,null,27]
[28,null,null,null,null,28]
[29,null,null,null,null,29]
[30,null,null,null,null,30]
[31,null,null,null,null,31]
[32,null,null,null,null,32]
[33,null,null,null,null,33]
[34,null,null,null,null,34]
[35,null,null,null,null,35]
[36,null,null,null,null,36]
[37,null,null,null,null,37]
[38,null,null,null,null,38]
[39,null,null,null,null,39]
[40,null,null,null,null,40]
[41,null,null,null,null,41]
[42,null,null,null,null,42]
[43,null,null,null,null,43]
[44,null,null,null,null,44]
[45,null,null,null,null,45]
[46,null,null,null,null,46]
[47,null,null,null,null,47]
[48,null,null,null,null,48]
[49,null,null,null,null,49]
[50,null,null,null,null,50]
[51,null,null,null,null,51]
[52,null,null,null,null,52]
[53,null,null,null,null,53]
[54,null,null,null,null,54]
[55,null,null,null,null,55]
[56,null,null,null,null,56]
[57,null,null,null,null,57]
[58,null,null,null,null,58]
[59,null,null,null,null,59]
[60,null,null,null,null,60]
[61,null,null,null,null,61]
[62,null,null,null,null,62]
[63,null,null,null,null,63]
[64,null,null,null,null,64]
[65,null,null,null,null,65]
[66,null,null,null,null,66]
[67,null,null,null,null,67]
[68,null,null,null,null,68]
[69,null,null,null,null,69]
[70,null,null,null,null,70]
[71,null,null,null,null,71]
[72,null,null,null,null,72]
[73,null,null,null,null,73]
[74,null,null,null,null,74]
[75,null,null,null,null,75]
[76,null,null,null,null,76]
[77,null,null,null,null,77]
[78,null,null,null,null,78]
[79,null,null,null,null,79]
[80,null,null,null,null,80]
[81,null,null,null,null,81]
[82,null,null,null,null,82]
[83,null,null,null,null,83]
[84,null,null,null,null,84]
[85,null,null,null,null,85]
[86,null,null,null,null,86]
[87,null,null,null,null,87]
[88,null,null,null,null,88]
[89,null,null,null,null,89]
[90,null,null,null,null,90]
[91,null,null,null,null,91]
[92,null,null,null,null,92]
[93,null,null,null,null,93]
[94,null,null,null,null,94]
[95,null,null,null,null,95]
[96,null,null,null,null,96]
[97,null,null,null,null,97]
[98,null,null,null,null,98]
[99,null,null,null,null,99]
[100,null,null,null,null,100]
[101,null,null,null,null,101]
[102,null,null,null,null,102]
[103,null,null,null,null,103]
[104,null,null,null,null,104]
[105,null,null,null,null,105]
[106,null,null,null,null,106]
[107,null,null,null,null,107]
[108,null,null,null,null,108]
[109,null,null,null,null,109]
[110,null,null,null,null,110]
[111,null,null,null,null,111]
[112,null,null,null,null,112]
[113,null,null,null,null,113]
[114,null,null,null,null,114]
[115,null,null,null,null,115]
[116,null,null,null,null,116]
[117,null,null,null,null,117]
[118,null,null,null,null,118]
{"$rows_left_out":383}
{"sheet":"ダブルス　選手名簿","index":2,"n_rows":502,"n_cols":11,"rows_kept":502,"cut":false,"hidden":false,"merged":[[0,0,0,1],[0,5,0,6]]}
["男子ダブルス",null,null,null,null,"女子ダブルス"]
[null,"氏名","チーム名","県名",null,null,"氏名","チーム名","県名",null,"※　氏名と氏名の間は，「Alt＋Enter」で改行してください。"]
[1,null,null,null,null,1]
[2,null,null,null,null,2]
[3,null,null,null,null,3]
[4,null,null,null,null,4]
[5,null,null,null,null,5]
[6,null,null,null,null,6]
[7,null,null,null,null,7]
[8,null,null,null,null,8]
[9,null,null,null,null,9]
[10,null,null,null,null,10]
[11,null,null,null,null,11]
[12,null,null,null,null,12]
[13,null,null,null,null,13]
[14,null,null,null,null,14]
[15,null,null,null,null,15]
[16,null,null,null,null,16]
[17,null,null,null,null,17]
[18,null,null,null,null,18]
[19,null,null,null,null,19]
[20,null,null,null,null,20]
[21,null,null,null,null,21]
[22,null,null,null,null,22]
[23,null,null,null,null,23]
[24,null,null,null,null,24]
[25,null,null,null,null,25]
[26,null,null,null,null,26]
[27,null,null,null,null,27]
[28,null,null,null,null,28]
[29,null,null,null,null,29]
[30,null,null,null,null,30]
[31,null,null,null,null,31]
[32,null,null,null,null,32]
[33,null,null,null,null,33]
[34,null,null,null,null,34]
[35,null,null,null,null,35]
[36,null,null,null,null,36]
[37,null,null,null,null,37]
[38,null,null,null,null,38]
[39,null,null,null,null,39]
[40,null,null,null,null,40]
[41,null,null,null,null,41]
[42,null,null,null,null,42]
[43,null,null,null,null,43]
[44,null,null,null,null,44]
[45,null,null,null,null,45]
[46,null,null,null,null,46]
[47,null,null,null,null,47]
[48,null,null,null,null,48]
[49,null,null,null,null,49]
[50,null,null,null,null,50]
[51,null,null,null,null,51]
[52,null,null,null,null,52]
[53,null,null,null,null,53]
[54,null,null,null,null,54]
[55,null,null,null,null,55]
[56,null,null,null,null,56]
[57,null,null,null,null,57]
[58,null,null,null,null,58]
[59,null,null,null,null,59]
[60,null,null,null,null,60]
[61,null,null,null,null,61]
[62,null,null,null,null,62]
[63,null,null,null,null,63]
[64,null,null,null,null,64]
[65,null,null,null,null,65]
[66,null,null,null,null,66]
[67,null,null,null,null,67]
[68,null,null,null,null,68]
[69,null,null,null,null,69]
[70,null,null,null,null,70]
[71,null,null,null,null,71]
[72,null,null,null,null,72]
[73,null,null,null,null,73]
[74,null,null,null,null,74]
[75,null,null,null,null,75]
[76,null,null,null,null,76]
[77,null,null,null,null,77]
[78,null,null,null,null,78]
[79,null,null,null,null,79]
[80,null,null,null,null,80]
[81,null,null,null,null,81]
[82,null,null,null,null,82]
[83,null,null,null,null,83]
[84,null,null,null,null,84]
[85,null,null,null,null,85]
[86,null,null,null,null,86]
[87,null,null,null,null,87]
[88,null,null,null,null,88]
[89,null,null,null,null,89]
[90,null,null,null,null,90]
[91,null,null,null,null,91]
[92,null,null,null,null,92]
[93,null,null,null,null,93]
[94,null,null,null,null,94]
[95,null,null,null,null,95]
[96,null,null,null,null,96]
[97,null,null,null,null,97]
[98,null,null,null,null,98]
[99,null,null,null,null,99]
[100,null,null,null,null,100]
[101,null,null,null,null,101]
[102,null,null,null,null,102]
[103,null,null,null,null,103]
[104,null,null,null,null,104]
[105,null,null,null,null,105]
[106,null,null,null,null,106]
[107,null,null,null,null,107]
[108,null,null,null,null,108]
[109,null,null,null,null,109]
[110,null,null,null,null,110]
[111,null,null,null,null,111]
[112,null,null,null,null,112]
[113,null,null,null,null,113]
[114,null,null,null,null,114]
[115,null,null,null,null,115]
[116,null,null,null,null,116]
[117,null,null,null,null,117]
[118,null,null,null,null,118]
{"$rows_left_out":383}
{"sheet":"選手参照","index":3,"n_rows":1952,"n_cols":4,"rows_kept":1952,"cut":false,"hidden":true,"merged":[]}
[]
[]
[11001,{"$f":"'シングルス　選手名簿'!B3","v":0},{"$f":"'シングルス　選手名簿'!C3","v":0},{"$f":"'シングルス　選手名簿'!D3","v":0}]
[11002,{"$f":"'シングルス　選手名簿'!B4","v":0},{"$f":"'シングルス　選手名簿'!C4","v":0},{"$f":"'シングルス　選手名簿'!D4","v":0}]
[11003,{"$f":"'シングルス　選手名簿'!B5","v":0},{"$f":"'シングルス　選手名簿'!C5","v":0},{"$f":"'シングルス　選手名簿'!D5","v":0}]
[11004,{"$f":"'シングルス　選手名簿'!B6","v":0},{"$f":"'シングルス　選手名簿'!C6","v":0},{"$f":"'シングルス　選手名簿'!D6","v":0}]
[11005,{"$f":"'シングルス　選手名簿'!B7","v":0},{"$f":"'シングルス　選手名簿'!C7","v":0},{"$f":"'シングルス　選手名簿'!D7","v":0}]
[11006,{"$f":"'シングルス　選手名簿'!B8","v":0},{"$f":"'シングルス　選手名簿'!C8","v":0},{"$f":"'シングルス　選手名簿'!D8","v":0}]
[11007,{"$f":"'シングルス　選手名簿'!B9","v":0},{"$f":"'シングルス　選手名簿'!C9","v":0},{"$f":"'シングルス　選手名簿'!D9","v":0}]
[11008,{"$f":"'シングルス　選手名簿'!B10","v":0},{"$f":"'シングルス　選手名簿'!C10","v":0},{"$f":"'シングルス　選手名簿'!D10","v":0}]
[11009,{"$f":"'シングルス　選手名簿'!B11","v":0},{"$f":"'シングルス　選手名簿'!C11","v":0},{"$f":"'シングルス　選手名簿'!D11","v":0}]
[11010,{"$f":"'シングルス　選手名簿'!B12","v":0},{"$f":"'シングルス　選手名簿'!C12","v":0},{"$f":"'シングルス　選手名簿'!D12","v":0}]
[11011,{"$f":"'シングルス　選手名簿'!B13","v":0},{"$f":"'シングルス　選手名簿'!C13","v":0},{"$f":"'シングルス　選手名簿'!D13","v":0}]
[11012,{"$f":"'シングルス　選手名簿'!B14","v":0},{"$f":"'シングルス　選手名簿'!C14","v":0},{"$f":"'シングルス　選手名簿'!D14","v":0}]
[11013,{"$f":"'シングルス　選手名簿'!B15","v":0},{"$f":"'シングルス　選手名簿'!C15","v":0},{"$f":"'シングルス　選手名簿'!D15","v":0}]
[11014,{"$f":"'シングルス　選手名簿'!B16","v":0},{"$f":"'シングルス　選手名簿'!C16","v":0},{"$f":"'シングルス　選手名簿'!D16","v":0}]
[11015,{"$f":"'シングルス　選手名簿'!B17","v":0},{"$f":"'シングルス　選手名簿'!C17","v":0},{"$f":"'シングルス　選手名簿'!D17","v":0}]
[11016,{"$f":"'シングルス　選手名簿'!B18","v":0},{"$f":"'シングルス　選手名簿'!C18","v":0},{"$f":"'シングルス　選手名簿'!D18","v":0}]
[11017,{"$f":"'シングルス　選手名簿'!B19","v":0},{"$f":"'シングルス　選手名簿'!C19","v":0},{"$f":"'シングルス　選手名簿'!D19","v":0}]
[11018,{"$f":"'シングルス　選手名簿'!B20","v":0},{"$f":"'シングルス　選手名簿'!C20","v":0},{"$f":"'シングルス　選手名簿'!D20","v":0}]
[11019,{"$f":"'シングルス　選手名簿'!B21","v":0},{"$f":"'シングルス　選手名簿'!C21","v":0},{"$f":"'シングルス　選手名簿'!D21","v":0}]
[11020,{"$f":"'シングルス　選手名簿'!B22","v":0},{"$f":"'シングルス　選手名簿'!C22","v":0},{"$f":"'シングルス　選手名簿'!D22","v":0}]
[11021,{"$f":"'シングルス　選手名簿'!B23","v":0},{"$f":"'シングルス　選手名簿'!C23","v":0},{"$f":"'シングルス　選手名簿'!D23","v":0}]
[11022,{"$f":"'シングルス　選手名簿'!B24","v":0},{"$f":"'シングルス　選手名簿'!C24","v":0},{"$f":"'シングルス　選手名簿'!D24","v":0}]
[11023,{"$f":"'シングルス　選手名簿'!B25","v":0},{"$f":"'シングルス　選手名簿'!C25","v":0},{"$f":"'シングルス　選手名簿'!D25","v":0}]
[11024,{"$f":"'シングルス　選手名簿'!B26","v":0},{"$f":"'シングルス　選手名簿'!C26","v":0},{"$f":"'シングルス　選手名簿'!D26","v":0}]
[11025,{"$f":"'シングルス　選手名簿'!B27","v":0},{"$f":"'シングルス　選手名簿'!C27","v":0},{"$f":"'シングルス　選手名簿'!D27","v":0}]
[11026,{"$f":"'シングルス　選手名簿'!B28","v":0},{"$f":"'シングルス　選手名簿'!C28","v":0},{"$f":"'シングルス　選手名簿'!D28","v":0}]
[11027,{"$f":"'シングルス　選手名簿'!B29","v":0},{"$f":"'シングルス　選手名簿'!C29","v":0},{"$f":"'シングルス　選手名簿'!D29","v":0}]
[11028,{"$f":"'シングルス　選手名簿'!B30","v":0},{"$f":"'シングルス　選手名簿'!C30","v":0},{"$f":"'シングルス　選手名簿'!D30","v":0}]
[11029,{"$f":"'シングルス　選手名簿'!B31","v":0},{"$f":"'シングルス　選手名簿'!C31","v":0},{"$f":"'シングルス　選手名簿'!D31","v":0}]
[11030,{"$f":"'シングルス　選手名簿'!B32","v":0},{"$f":"'シングルス　選手名簿'!C32","v":0},{"$f":"'シングルス　選手名簿'!D32","v":0}]
[11031,{"$f":"'シングルス　選手名簿'!B33","v":0},{"$f":"'シングルス　選手名簿'!C33","v":0},{"$f":"'シングルス　選手名簿'!D33","v":0}]
[11032,{"$f":"'シングルス　選手名簿'!B34","v":0},{"$f":"'シングルス　選手名簿'!C34","v":0},{"$f":"'シングルス　選手名簿'!D34","v":0}]
[11033,{"$f":"'シングルス　選手名簿'!B35","v":0},{"$f":"'シングルス　選手名簿'!C35","v":0},{"$f":"'シングルス　選手名簿'!D35","v":0}]
[11034,{"$f":"'シングルス　選手名簿'!B36","v":0},{"$f":"'シングルス　選手名簿'!C36","v":0},{"$f":"'シングルス　選手名簿'!D36","v":0}]
[11035,{"$f":"'シングルス　選手名簿'!B37","v":0},{"$f":"'シングルス　選手名簿'!C37","v":0},{"$f":"'シングルス　選手名簿'!D37","v":0}]
[11036,{"$f":"'シングルス　選手名簿'!B38","v":0},{"$f":"'シングルス　選手名簿'!C38","v":0},{"$f":"'シングルス　選手名簿'!D38","v":0}]
[11037,{"$f":"'シングルス　選手名簿'!B39","v":0},{"$f":"'シングルス　選手名簿'!C39","v":0},{"$f":"'シングルス　選手名簿'!D39","v":0}]
[11038,{"$f":"'シングルス　選手名簿'!B40","v":0},{"$f":"'シングルス　選手名簿'!C40","v":0},{"$f":"'シングルス　選手名簿'!D40","v":0}]
[11039,{"$f":"'シングルス　選手名簿'!B41","v":0},{"$f":"'シングルス　選手名簿'!C41","v":0},{"$f":"'シングルス　選手名簿'!D41","v":0}]
[11040,{"$f":"'シングルス　選手名簿'!B42","v":0},{"$f":"'シングルス　選手名簿'!C42","v":0},{"$f":"'シングルス　選手名簿'!D42","v":0}]
[11041,{"$f":"'シングルス　選手名簿'!B43","v":0},{"$f":"'シングルス　選手名簿'!C43","v":0},{"$f":"'シングルス　選手名簿'!D43","v":0}]
[11042,{"$f":"'シングルス　選手名簿'!B44","v":0},{"$f":"'シングルス　選手名簿'!C44","v":0},{"$f":"'シングルス　選手名簿'!D44","v":0}]
[11043,{"$f":"'シングルス　選手名簿'!B45","v":0},{"$f":"'シングルス　選手名簿'!C45","v":0},{"$f":"'シングルス　選手名簿'!D45","v":0}]
[11044,{"$f":"'シングルス　選手名簿'!B46","v":0},{"$f":"'シングルス　選手名簿'!C46","v":0},{"$f":"'シングルス　選手名簿'!D46","v":0}]
[11045,{"$f":"'シングルス　選手名簿'!B47","v":0},{"$f":"'シングルス　選手名簿'!C47","v":0},{"$f":"'シングルス　選手名簿'!D47","v":0}]
[11046,{"$f":"'シングルス　選手名簿'!B48","v":0},{"$f":"'シングルス　選手名簿'!C48","v":0},{"$f":"'シングルス　選手名簿'!D48","v":0}]
[11047,{"$f":"'シングルス　選手名簿'!B49","v":0},{"$f":"'シングルス　選手名簿'!C49","v":0},{"$f":"'シングルス　選手名簿'!D49","v":0}]
[11048,{"$f":"'シングルス　選手名簿'!B50","v":0},{"$f":"'シングルス　選手名簿'!C50","v":0},{"$f":"'シングルス　選手名簿'!D50","v":0}]
[11049,{"$f":"'シングルス　選手名簿'!B51","v":0},{"$f":"'シングルス　選手名簿'!C51","v":0},{"$f":"'シングルス　選手名簿'!D51","v":0}]
[11050,{"$f":"'シングルス　選手名簿'!B52","v":0},{"$f":"'シングルス　選手名簿'!C52","v":0},{"$f":"'シングルス　選手名簿'!D52","v":0}]
[11051,{"$f":"'シングルス　選手名簿'!B53","v":0},{"$f":"'シングルス　選手名簿'!C53","v":0},{"$f":"'シングルス　選手名簿'!D53","v":0}]
[11052,{"$f":"'シングルス　選手名簿'!B54","v":0},{"$f":"'シングルス　選手名簿'!C54","v":0},{"$f":"'シングルス　選手名簿'!D54","v":0}]
[11053,{"$f":"'シングルス　選手名簿'!B55","v":0},{"$f":"'シングルス　選手名簿'!C55","v":0},{"$f":"'シングルス　選手名簿'!D55","v":0}]
[11054,{"$f":"'シングルス　選手名簿'!B56","v":0},{"$f":"'シングルス　選手名簿'!C56","v":0},{"$f":"'シングルス　選手名簿'!D56","v":0}]
[11055,{"$f":"'シングルス　選手名簿'!B57","v":0},{"$f":"'シングルス　選手名簿'!C57","v":0},{"$f":"'シングルス　選手名簿'!D57","v":0}]
[11056,{"$f":"'シングルス　選手名簿'!B58","v":0},{"$f":"'シングルス　選手名簿'!C58","v":0},{"$f":"'シングルス　選手名簿'!D58","v":0}]
[11057,{"$f":"'シングルス　選手名簿'!B59","v":0},{"$f":"'シングルス　選手名簿'!C59","v":0},{"$f":"'シングルス　選手名簿'!D59","v":0}]
[11058,{"$f":"'シングルス　選手名簿'!B60","v":0},{"$f":"'シングルス　選手名簿'!C60","v":0},{"$f":"'シングルス　選手名簿'!D60","v":0}]
[11059,{"$f":"'シングルス　選手名簿'!B61","v":0},{"$f":"'シングルス　選手名簿'!C61","v":0},{"$f":"'シングルス　選手名簿'!D61","v":0}]
[11060,{"$f":"'シングルス　選手名簿'!B62","v":0},{"$f":"'シングルス　選手名簿'!C62","v":0},{"$f":"'シングルス　選手名簿'!D62","v":0}]
[11061,{"$f":"'シングルス　選手名簿'!B63","v":0},{"$f":"'シングルス　選手名簿'!C63","v":0},{"$f":"'シングルス　選手名簿'!D63","v":0}]
[11062,{"$f":"'シングルス　選手名簿'!B64","v":0},{"$f":"'シングルス　選手名簿'!C64","v":0},{"$f":"'シングルス　選手名簿'!D64","v":0}]
[11063,{"$f":"'シングルス　選手名簿'!B65","v":0},{"$f":"'シングルス　選手名簿'!C65","v":0},{"$f":"'シングルス　選手名簿'!D65","v":0}]
[11064,{"$f":"'シングルス　選手名簿'!B66","v":0},{"$f":"'シングルス　選手名簿'!C66","v":0},{"$f":"'シングルス　選手名簿'!D66","v":0}]
[11065,{"$f":"'シングルス　選手名簿'!B67","v":0},{"$f":"'シングルス　選手名簿'!C67","v":0},{"$f":"'シングルス　選手名簿'!D67","v":0}]
[11066,{"$f":"'シングルス　選手名簿'!B68","v":0},{"$f":"'シングルス　選手名簿'!C68","v":0},{"$f":"'シングルス　選手名簿'!D68","v":0}]
[11067,{"$f":"'シングルス　選手名簿'!B69","v":0},{"$f":"'シングルス　選手名簿'!C69","v":0},{"$f":"'シングルス　選手名簿'!D69","v":0}]
[11068,{"$f":"'シングルス　選手名簿'!B70","v":0},{"$f":"'シングルス　選手名簿'!C70","v":0},{"$f":"'シングルス　選手名簿'!D70","v":0}]
[11069,{"$f":"'シングルス　選手名簿'!B71","v":0},{"$f":"'シングルス　選手名簿'!C71","v":0},{"$f":"'シングルス　選手名簿'!D71","v":0}]
[11070,{"$f":"'シングルス　選手名簿'!B72","v":0},{"$f":"'シングルス　選手名簿'!C72","v":0},{"$f":"'シングルス　選手名簿'!D72","v":0}]
[11071,{"$f":"'シングルス　選手名簿'!B73","v":0},{"$f":"'シングルス　選手名簿'!C73","v":0},{"$f":"'シングルス　選手名簿'!D73","v":0}]
[11072,{"$f":"'シングルス　選手名簿'!B74","v":0},{"$f":"'シングルス　選手名簿'!C74","v":0},{"$f":"'シングルス　選手名簿'!D74","v":0}]
[11073,{"$f":"'シングルス　選手名簿'!B75","v":0},{"$f":"'シングルス　選手名簿'!C75","v":0},{"$f":"'シングルス　選手名簿'!D75","v":0}]
[11074,{"$f":"'シングルス　選手名簿'!B76","v":0},{"$f":"'シングルス　選手名簿'!C76","v":0},{"$f":"'シングルス　選手名簿'!D76","v":0}]
[11075,{"$f":"'シングルス　選手名簿'!B77","v":0},{"$f":"'シングルス　選手名簿'!C77","v":0},{"$f":"'シングルス　選手名簿'!D77","v":0}]
[11076,{"$f":"'シングルス　選手名簿'!B78","v":0},{"$f":"'シングルス　選手名簿'!C78","v":0},{"$f":"'シングルス　選手名簿'!D78","v":0}]
[11077,{"$f":"'シングルス　選手名簿'!B79","v":0},{"$f":"'シングルス　選手名簿'!C79","v":0},{"$f":"'シングルス　選手名簿'!D79","v":0}]
[11078,{"$f":"'シングルス　選手名簿'!B80","v":0},{"$f":"'シングルス　選手名簿'!C80","v":0},{"$f":"'シングルス　選手名簿'!D80","v":0}]
[11079,{"$f":"'シングルス　選手名簿'!B81","v":0},{"$f":"'シングルス　選手名簿'!C81","v":0},{"$f":"'シングルス　選手名簿'!D81","v":0}]
[11080,{"$f":"'シングルス　選手名簿'!B82","v":0},{"$f":"'シングルス　選手名簿'!C82","v":0},{"$f":"'シングルス　選手名簿'!D82","v":0}]
[11081,{"$f":"'シングルス　選手名簿'!B83","v":0},{"$f":"'シングルス　選手名簿'!C83","v":0},{"$f":"'シングルス　選手名簿'!D83","v":0}]
[11082,{"$f":"'シングルス　選手名簿'!B84","v":0},{"$f":"'シングルス　選手名簿'!C84","v":0},{"$f":"'シングルス　選手名簿'!D84","v":0}]
[11083,{"$f":"'シングルス　選手名簿'!B85","v":0},{"$f":"'シングルス　選手名簿'!C85","v":0},{"$f":"'シングルス　選手名簿'!D85","v":0}]
[11084,{"$f":"'シングルス　選手名簿'!B86","v":0},{"$f":"'シングルス　選手名簿'!C86","v":0},{"$f":"'シングルス　選手名簿'!D86","v":0}]
[11085,{"$f":"'シングルス　選手名簿'!B87","v":0},{"$f":"'シングルス　選手名簿'!C87","v":0},{"$f":"'シングルス　選手名簿'!D87","v":0}]
[11086,{"$f":"'シングルス　選手名簿'!B88","v":0},{"$f":"'シングルス　選手名簿'!C88","v":0},{"$f":"'シングルス　選手名簿'!D88","v":0}]
[11087,{"$f":"'シングルス　選手名簿'!B89","v":0},{"$f":"'シングルス　選手名簿'!C89","v":0},{"$f":"'シングルス　選手名簿'!D89","v":0}]
[11088,{"$f":"'シングルス　選手名簿'!B90","v":0},{"$f":"'シングルス　選手名簿'!C90","v":0},{"$f":"'シングルス　選手名簿'!D90","v":0}]
[11089,{"$f":"'シングルス　選手名簿'!B91","v":0},{"$f":"'シングルス　選手名簿'!C91","v":0},{"$f":"'シングルス　選手名簿'!D91","v":0}]
[11090,{"$f":"'シングルス　選手名簿'!B92","v":0},{"$f":"'シングルス　選手名簿'!C92","v":0},{"$f":"'シングルス　選手名簿'!D92","v":0}]
[11091,{"$f":"'シングルス　選手名簿'!B93","v":0},{"$f":"'シングルス　選手名簿'!C93","v":0},{"$f":"'シングルス　選手名簿'!D93","v":0}]
[11092,{"$f":"'シングルス　選手名簿'!B94","v":0},{"$f":"'シングルス　選手名簿'!C94","v":0},{"$f":"'シングルス　選手名簿'!D94","v":0}]
[11093,{"$f":"'シングルス　選手名簿'!B95","v":0},{"$f":"'シングルス　選手名簿'!C95","v":0},{"$f":"'シングルス　選手名簿'!D95","v":0}]
[11094,{"$f":"'シングルス　選手名簿'!B96","v":0},{"$f":"'シングルス　選手名簿'!C96","v":0},{"$f":"'シングルス　選手名簿'!D96","v":0}]
[11095,{"$f":"'シングルス　選手名簿'!B97","v":0},{"$f":"'シングルス　選手名簿'!C97","v":0},{"$f":"'シングルス　選手名簿'!D97","v":0}]
[11096,{"$f":"'シングルス　選手名簿'!B98","v":0},{"$f":"'シングルス　選手名簿'!C98","v":0},{"$f":"'シングルス　選手名簿'!D98","v":0}]
[11097,{"$f":"'シングルス　選手名簿'!B99","v":0},{"$f":"'シングルス　選手名簿'!C99","v":0},{"$f":"'シングルス　選手名簿'!D99","v":0}]
[11098,{"$f":"'シングルス　選手名簿'!B100","v":0},{"$f":"'シングルス　選手名簿'!C100","v":0},{"$f":"'シングルス　選手名簿'!D100","v":0}]
[11099,{"$f":"'シングルス　選手名簿'!B101","v":0},{"$f":"'シングルス　選手名簿'!C101","v":0},{"$f":"'シングルス　選手名簿'!D101","v":0}]
[11100,{"$f":"'シングルス　選手名簿'!B102","v":0},{"$f":"'シングルス　選手名簿'!C102","v":0},{"$f":"'シングルス　選手名簿'!D102","v":0}]
[11101,{"$f":"'シングルス　選手名簿'!B103","v":0},{"$f":"'シングルス　選手名簿'!C103","v":0},{"$f":"'シングルス　選手名簿'!D103","v":0}]
[11102,{"$f":"'シングルス　選手名簿'!B104","v":0},{"$f":"'シングルス　選手名簿'!C104","v":0},{"$f":"'シングルス　選手名簿'!D104","v":0}]
[11103,{"$f":"'シングルス　選手名簿'!B105","v":0},{"$f":"'シングルス　選手名簿'!C105","v":0},{"$f":"'シングルス　選手名簿'!D105","v":0}]
[11104,{"$f":"'シングルス　選手名簿'!B106","v":0},{"$f":"'シングルス　選手名簿'!C106","v":0},{"$f":"'シングルス　選手名簿'!D106","v":0}]
[11105,{"$f":"'シングルス　選手名簿'!B107","v":0},{"$f":"'シングルス　選手名簿'!C107","v":0},{"$f":"'シングルス　選手名簿'!D107","v":0}]
[11106,{"$f":"'シングルス　選手名簿'!B108","v":0},{"$f":"'シングルス　選手名簿'!C108","v":0},{"$f":"'シングルス　選手名簿'!D108","v":0}]
[11107,{"$f":"'シングルス　選手名簿'!B109","v":0},{"$f":"'シングルス　選手名簿'!C109","v":0},{"$f":"'シングルス　選手名簿'!D109","v":0}]
[11108,{"$f":"'シングルス　選手名簿'!B110","v":0},{"$f":"'シングルス　選手名簿'!C110","v":0},{"$f":"'シングルス　選手名簿'!D110","v":0}]
[11109,{"$f":"'シングルス　選手名簿'!B111","v":0},{"$f":"'シングルス　選手名簿'!C111","v":0},{"$f":"'シングルス　選手名簿'!D111","v":0}]
[11110,{"$f":"'シングルス　選手名簿'!B112","v":0},{"$f":"'シングルス　選手名簿'!C112","v":0},{"$f":"'シングルス　選手名簿'!D112","v":0}]
[11111,{"$f":"'シングルス　選手名簿'!B113","v":0},{"$f":"'シングルス　選手名簿'!C113","v":0},{"$f":"'シングルス　選手名簿'!D113","v":0}]
[11112,{"$f":"'シングルス　選手名簿'!B114","v":0},{"$f":"'シングルス　選手名簿'!C114","v":0},{"$f":"'シングルス　選手名簿'!D114","v":0}]
[11113,{"$f":"'シングルス　選手名簿'!B115","v":0},{"$f":"'シングルス　選手名簿'!C115","v":0},{"$f":"'シングルス　選手名簿'!D115","v":0}]
[11114,{"$f":"'シングルス　選手名簿'!B116","v":0},{"$f":"'シングルス　選手名簿'!C116","v":0},{"$f":"'シングルス　選手名簿'!D116","v":0}]
[11115,{"$f":"'シングルス　選手名簿'!B117","v":0},{"$f":"'シングルス　選手名簿'!C117","v":0},{"$f":"'シングルス　選手名簿'!D117","v":0}]
[11116,{"$f":"'シングルス　選手名簿'!B118","v":0},{"$f":"'シングルス　選手名簿'!C118","v":0},{"$f":"'シングルス　選手名簿'!D118","v":0}]
[11117,{"$f":"'シングルス　選手名簿'!B119","v":0},{"$f":"'シングルス　選手名簿'!C119","v":0},{"$f":"'シングルス　選手名簿'!D119","v":0}]
[11118,{"$f":"'シングルス　選手名簿'!B120","v":0},{"$f":"'シングルス　選手名簿'!C120","v":0},{"$f":"'シングルス　選手名簿'!D120","v":0}]
{"$rows_left_out":1833}
{"sheet":"参照","index":4,"n_rows":19,"n_cols":2,"rows_kept":19,"cut":false,"hidden":true,"merged":[]}
[]
["個人戦"]
[1,"シングルス"]
[2,"ダブルス"]
[]
["性別"]
[1,"男子"]
[2,"女子"]
[]
["○回戦"]
[1,"１"]
[2,"２"]
[3,"３"]
[4,"４"]
[5,"５"]
[6,"６"]
[7,"準決勝"]
[8,"決　勝"]
[9,"決定戦"]